BDBM50319218 6-[3-(4-benzenesulfonylamino-benzoyl)-ureido]-hexanoic acid hydroxyamide::CHEMBL1084019
SMILES ONC(=O)CCCCCNC(=O)NC(=O)c1ccc(NS(=O)(=O)c2ccccc2)cc1
InChI Key InChIKey=SBMQYDBFUGYFTK-UHFFFAOYSA-N
Data  2 IC50
  Tab Delimited (TSV)   2D SDfile   Computed 3D by Vconf -m prep SDfile
Find this compound or compounds like it in BindingDB:
Activity Spreadsheet -- Enzyme Inhibition Constant Data from BindingDB
Found 2 hits for monomerid = 50319218
TargetHistone deacetylase 1(Homo sapiens (Human))
S*Bio
Curated by ChEMBL
LigandPNGBDBM50319218(6-[3-(4-benzenesulfonylamino-benzoyl)-ureido]-hexa...)
Affinity DataIC50:  97nM. Assay description: Inhibition of HDAC1 in human COLO205 cells assessed as induction of histone H3 acetylation
In DepthDetails ArticlePubMed
TargetHistone deacetylase 1(Homo sapiens (Human))
S*Bio
Curated by ChEMBL
LigandPNGBDBM50319218(6-[3-(4-benzenesulfonylamino-benzoyl)-ureido]-hexa...)
Affinity DataIC50: >1.00E+5nM. Assay description: Inhibition of HDAC1 in human COLO205 cells assessed as induction of histone H3 acetylation
In DepthDetails ArticlePubMed