BDBM50319311 1-phenyl-2-(1-phenyl-1H-tetrazol-5-ylthio)ethanone::CHEMBL1086562
SMILES O=C(CSc1cnnn1-c1ccccc1)c1ccccc1
InChI Key InChIKey=IUFRQIYKTUXDJY-UHFFFAOYSA-N
Data  1 IC50
  Tab Delimited (TSV)   2D SDfile   Computed 3D by Vconf -m prep SDfile
Find this compound or compounds like it in BindingDB:
Activity Spreadsheet -- Enzyme Inhibition Constant Data from BindingDB
Found 1 hit for monomerid = 50319311
Target11-beta-hydroxysteroid dehydrogenase 1(Homo sapiens (Human))
University Of Edinburgh
Curated by ChEMBL
LigandPNGBDBM50319311(1-phenyl-2-(1-phenyl-1H-tetrazol-5-ylthio)ethanone...)
Affinity DataIC50:  257nM. Assay description: Inhibition of human 11beta-HSD1 expressed in HEK293 cells by scintillation proximity assay
In DepthDetails ArticlePubMed