BDBM50320449 (-)-ZILEUTON::CHEMBL1164975
SMILES C[C@H](N(O)C(N)=O)c1cc2ccccc2s1
InChI Key InChIKey=MWLSOWXNZPKENC-ZETCQYMHSA-N
Data  1 KI  1 IC50
  Tab Delimited (TSV)   2D SDfile   Computed 3D by Vconf -m prep SDfile
Find this compound or compounds like it in BindingDB:
Activity Spreadsheet -- Enzyme Inhibition Constant Data from BindingDB
Found 2 hits for monomerid = 50320449
TargetCytochrome P450 1A2(Homo sapiens (Human))
F. Hoffmann-La Roche
Curated by ChEMBL
LigandPNGBDBM50320449((-)-ZILEUTON | CHEMBL1164975)
Affinity DataKi:  9.82E+4nM. Assay description: Mechanism based inhibition of human cytochrome P450 1A2 measured by phenacetin O-deethylation (POD)
In DepthDetails ArticlePubMed
TargetPolyunsaturated fatty acid 5-lipoxygenase(Homo sapiens (Human))
University Of California Santa Cruz
Curated by ChEMBL
LigandPNGBDBM50320449((-)-ZILEUTON | CHEMBL1164975)
Affinity DataIC50:  500nM. Assay description: Inhibition of human N-terminal His6-tagged 5-lipoxygenase arachidonic acid by UV-vis spectrometry
In DepthDetails ArticlePubMed