BDBM50320709 5-(4-Fluorobenzoyl)-2-{3-[3-fluoro-5-(4-methoxytetrahydro-4H-4-pyranyl)phenoxy]propyl}-8-methoxy-2,3,4,5-tetrahydro-1H-pyrido[4,3-b]indole hydrochloride::CHEMBL1163243
SMILES COc1ccc2n(C(=O)c3ccc(F)cc3)c3CCN(CCCOc4cc(F)cc(c4)C4(CCOCC4)OC)Cc3c2c1
InChI Key InChIKey=MJBSGVLSOJUQSW-UHFFFAOYSA-N
Data  3 IC50
  Tab Delimited (TSV)   2D SDfile   Computed 3D by Vconf -m prep SDfile
Find this compound or compounds like it in BindingDB:
Activity Spreadsheet -- Enzyme Inhibition Constant Data from BindingDB
Found 3 hits for monomerid = 50320709
TargetPolyunsaturated fatty acid 5-lipoxygenase(Homo sapiens (Human))
Universit£
Curated by ChEMBL
LigandPNGBDBM50320709(5-(4-Fluorobenzoyl)-2-{3-[3-fluoro-5-(4-methoxytet...)
Affinity DataIC50:  5.80E+4nM. Assay description: Inhibition of 5-lipoxygenase in human whole blood assessed as inhibition of LTB4 production by HPLC method
In DepthDetails ArticlePubMed
TargetProstaglandin G/H synthase 2(Homo sapiens (Human))
Universit£
Curated by ChEMBL
LigandPNGBDBM50320709(5-(4-Fluorobenzoyl)-2-{3-[3-fluoro-5-(4-methoxytet...)
Affinity DataIC50:  5.36E+4nM. Assay description: Inhibition of COX2 in human whole blood assessed as inhibition of 12-hydroxyheptadecatrienoic acid production by HPLC method
In DepthDetails ArticlePubMed
TargetPolyunsaturated fatty acid 5-lipoxygenase(Homo sapiens (Human))
Universit£
Curated by ChEMBL
LigandPNGBDBM50320709(5-(4-Fluorobenzoyl)-2-{3-[3-fluoro-5-(4-methoxytet...)
Affinity DataIC50:  5.99E+4nM. Assay description: Inhibition of 5-lipoxygenase in human whole blood assessed as inhibition of 5-hydroxyeicosatetraenoic acid production by HPLC method
In DepthDetails ArticlePubMed