BDBM50321688 4-bromobenzyl allyl(1-(((3S,4R)-1-(cyclopentanecarbonyl)-4-hydroxy-4-phenylpyrrolidin-3-yl)methyl)piperidin-4-yl)carbamate::CHEMBL1172044
SMILES O[C@@]1(CN(C[C@@H]1CN1CCC(CC1)N(CC=C)C(=O)OCc1ccc(Br)cc1)C(=O)C1CCCC1)c1ccccc1
InChI Key InChIKey=ASURRQIJEAPFRY-UVMMSNCQSA-N
Data  1 IC50
  Tab Delimited (TSV)   2D SDfile   Computed 3D by Vconf -m prep SDfile
Find this compound or compounds like it in BindingDB:
Activity Spreadsheet -- Enzyme Inhibition Constant Data from BindingDB
Found 1 hit for monomerid = 50321688
TargetC-C chemokine receptor type 5(Homo sapiens (Human))
Chinese Academy Of Sciences
Curated by ChEMBL
LigandPNGBDBM50321688(4-bromobenzyl allyl(1-(((3S,4R)-1-(cyclopentanecar...)
Affinity DataIC50:  20nM. Assay description: Antagonist activity at CCR5 expressed in CHO cells assessed as inhibition of RANTES-induced [35S]GTPgamma binding by scintillation proximity assay
In DepthDetails ArticlePubMed