BDBM50321691 4-methoxybenzyl allyl(1-(((3S,4R)-1-(cyclopentanecarbonyl)-4-hydroxy-4-phenylpyrrolidin-3-yl)methyl)piperidin-4-yl)carbamate::CHEMBL1172036
SMILES COc1ccc(COC(=O)N(CC=C)C2CCN(C[C@H]3CN(C[C@]3(O)c3ccccc3)C(=O)C3CCCC3)CC2)cc1
InChI Key InChIKey=HSTRPZBEJNYABI-DODOAAEWSA-N
Data  1 IC50
  Tab Delimited (TSV)   2D SDfile   Computed 3D by Vconf -m prep SDfile
Find this compound or compounds like it in BindingDB:
Activity Spreadsheet -- Enzyme Inhibition Constant Data from BindingDB
Found 1 hit for monomerid = 50321691
TargetC-C chemokine receptor type 5(Homo sapiens (Human))
Chinese Academy Of Sciences
Curated by ChEMBL
LigandPNGBDBM50321691(4-methoxybenzyl allyl(1-(((3S,4R)-1-(cyclopentanec...)
Affinity DataIC50:  6.20nM. Assay description: Antagonist activity at CCR5 expressed in CHO cells assessed as inhibition of RANTES-induced [35S]GTPgamma binding by scintillation proximity assay
In DepthDetails ArticlePubMed