BDBM50321771 (R)-ethyl 2-(1'-benzylspiro[isochroman-1,4'-piperidine]-3-yl)acetate::CHEMBL1170333
SMILES CCOC(=O)C[C@H]1Cc2ccccc2C2(CCN(Cc3ccccc3)CC2)O1
InChI Key InChIKey=BFYFCBBJFMGJDA-OAQYLSRUSA-N
Data  2 KI
  Tab Delimited (TSV)   2D SDfile   Computed 3D by Vconf -m prep SDfile
Find this compound or compounds like it in BindingDB:
Activity Spreadsheet -- Enzyme Inhibition Constant Data from BindingDB
Found 2 hits for monomerid = 50321771
TargetSigma non-opioid intracellular receptor 1(Cavia porcellus (Guinea pig))
Institut F£R Pharmazeutische Und Medizinische Chemie Der Universit£T M£Nster
Curated by ChEMBL
LigandPNGBDBM50321771((R)-ethyl 2-(1'-benzylspiro[isochroman-1,4'-piperi...)
Affinity DataKi:  4.40E+3nM. Assay description: Displacement of [3H]-(+)-pentazocine from sigma 1 receptor in guinea pig brain membrane
In DepthDetails ArticlePubMed
TargetSigma non-opioid intracellular receptor 1(Cavia porcellus (Guinea pig))
Institut F£R Pharmazeutische Und Medizinische Chemie Der Universit£T M£Nster
Curated by ChEMBL
LigandPNGBDBM50321771((R)-ethyl 2-(1'-benzylspiro[isochroman-1,4'-piperi...)
Affinity DataKi:  4.40E+3nM. Assay description: Displacement of [3H]-(+)-pentazocine from sigma 1 receptor in guinea pig brain membrane
In DepthDetails ArticlePubMed