BDBM50321789 (R)-ethyl 2-(1-benzyl-6',7'-dihydrospiro[piperidine-4,4'-thieno[3,2-c]pyran]-6'-yl)acetate::CHEMBL1170773
SMILES CCOC(=O)C[C@@H]1Cc2sccc2C2(CCN(Cc3ccccc3)CC2)O1
InChI Key InChIKey=BVOZTBCOMSOLRD-SFHVURJKSA-N
Data  3 KI
  Tab Delimited (TSV)   2D SDfile   Computed 3D by Vconf -m prep SDfile
Find this compound or compounds like it in BindingDB:
Activity Spreadsheet -- Enzyme Inhibition Constant Data from BindingDB
Found 3 hits for monomerid = 50321789
TargetSigma non-opioid intracellular receptor 1(Cavia porcellus (Guinea pig))
Institut F£R Pharmazeutische Und Medizinische Chemie Der Universit£T M£Nster
Curated by ChEMBL
LigandPNGBDBM50321789((R)-ethyl 2-(1-benzyl-6',7'-dihydrospiro[piperidin...)
Affinity DataKi:  5.40nM. Assay description: Displacement of [3H]-(+)-pentazocine from sigma 1 receptor in guinea pig brain membrane
In DepthDetails ArticlePubMed
TargetSigma non-opioid intracellular receptor 1(Cavia porcellus (Guinea pig))
Institut F£R Pharmazeutische Und Medizinische Chemie Der Universit£T M£Nster
Curated by ChEMBL
LigandPNGBDBM50321789((R)-ethyl 2-(1-benzyl-6',7'-dihydrospiro[piperidin...)
Affinity DataKi:  5.40nM. Assay description: Displacement of [3H]-(+)-pentazocine from sigma 1 receptor in guinea pig brain membrane
In DepthDetails ArticlePubMed
TargetSigma non-opioid intracellular receptor 1(Cavia porcellus (Guinea pig))
Institut F£R Pharmazeutische Und Medizinische Chemie Der Universit£T M£Nster
Curated by ChEMBL
LigandPNGBDBM50321789((R)-ethyl 2-(1-benzyl-6',7'-dihydrospiro[piperidin...)
Affinity DataKi:  20nM. Assay description: Displacement of [3H]-(+)pentazocine from guinea pig brain sigma 1-type opioid receptor after 120 mins by scintillation counting analysis
In DepthDetails ArticlePubMed