BDBM50322736 2-(2,3-dihydrobenzo[b][1,4]dioxin-6-yl)-2-oxoethyl 2-(4-chlorobenzamido)acetate::CHEMBL1172972
SMILES Clc1ccc(cc1)C(=O)NCC(=O)OCC(=O)c1ccc2OCCOc2c1
InChI Key InChIKey=RWGXNTUFMXASQV-UHFFFAOYSA-N
Data  1 IC50
  Tab Delimited (TSV)   2D SDfile   Computed 3D by Vconf -m prep SDfile
Find this compound or compounds like it in BindingDB:
Activity Spreadsheet -- Enzyme Inhibition Constant Data from BindingDB
Found 1 hit for monomerid = 50322736
TargetCruzipain(Trypanosoma cruzi)
University Of California San Francisco
Curated by ChEMBL
LigandPNGBDBM50322736(2-(2,3-dihydrobenzo[b][1,4]dioxin-6-yl)-2-oxoethyl...)
Affinity DataIC50:  500nM. Assay description: Inhibition of Trypanosoma cruzi cruzain assessed as Z-Phe-Arg-aminomethylcoumarin cleavage
In DepthDetails ArticlePubMed