BDBM50322757 3-O-[(6-O-isoferuloyl)-beta-D-glucopyranosyl]-(1-4)-beta-D-glucopyranosyl-(1-4)-beta-D-ribopyranosyl-(1-3)-alpha-L-rhamnopyranosyl-(1f2)-alphaL-arabinopyranosyl hederagenin 28-O-alpha-L-rhamnopyranosyl(1-4)-beta-D-glucopyranosyl-(1-6)-beta-D-glucopyranoside::CHEMBL1171254
SMILES COc1ccc(\C=C\C(=O)OC[C@H]2O[C@@H](O[C@@H]3[C@@H](CO)O[C@@H](O[C@@H]4CO[C@@H](O[C@@H]5[C@@H](O)[C@H](C)O[C@@H](O[C@@H]6[C@@H](O)[C@H](O)CO[C@H]6O[C@H]6CC[C@@]7(C)[C@@H](CC[C@]8(C)[C@@H]7CC=C7[C@@H]9CC(C)(C)CC[C@@]9(CC[C@@]87C)C(=O)O[C@@H]7O[C@H](CO[C@@H]8O[C@H](CO)[C@@H](O[C@@H]9O[C@@H](C)[C@H](O)[C@@H](O)[C@H]9O)[C@H](O)[C@H]8O)[C@@H](O)[C@H](O)[C@H]7O)[C@]6(C)CO)[C@@H]5O)[C@H](O)[C@@H]4O)[C@H](O)[C@H]3O)[C@H](O)[C@@H](O)[C@@H]2O)cc1O
InChI Key InChIKey=VHCSZQUYNKUEQK-XAOHDVSWSA-N
Data  2 IC50
  Tab Delimited (TSV)   2D SDfile   Computed 3D by Vconf -m prep SDfile
Find this compound or compounds like it in BindingDB:
Activity Spreadsheet -- Enzyme Inhibition Constant Data from BindingDB
Found 2 hits for monomerid = 50322757
TargetProstaglandin G/H synthase 2(Homo sapiens (Human))
Peking University Health Science Center
Curated by ChEMBL
LigandPNGBDBM50322757(3-O-[(6-O-isoferuloyl)-beta-D-glucopyranosyl]-(1-4...)
Affinity DataIC50:  7.90E+3nM. Assay description: Inhibition of COX2 by microplate reader
In DepthDetails ArticlePubMed
TargetProstaglandin G/H synthase 1(Homo sapiens (Human))
Peking University Health Science Center
Curated by ChEMBL
LigandPNGBDBM50322757(3-O-[(6-O-isoferuloyl)-beta-D-glucopyranosyl]-(1-4...)
Affinity DataIC50:  8.90E+3nM. Assay description: Inhibition of COX1 by microplate reader
In DepthDetails ArticlePubMed