BDBM50323686 Pemirolast
SMILES Cc1cccn2c1ncc(-c1nnn[nH]1)c2=O
InChI Key InChIKey=HIANJWSAHKJQTH-UHFFFAOYSA-N
Data  1 EC50
  Tab Delimited (TSV)   2D SDfile   Computed 3D by Vconf -m prep SDfile
Find this compound or compounds like it in BindingDB:
Activity Spreadsheet -- Enzyme Inhibition Constant Data from BindingDB
Found 1 hit for monomerid = 50323686
TargetG protein-coupled receptor GPR35(Rattus norvegicus)
Chinese Academy Of Sciences
Curated by ChEMBL
LigandPNGBDBM50323686(Pemirolast)
Affinity DataEC50:  95nM. Assay description: Agonist activity at recombinant rat N-terminal FLAG/eYFP-fused GPR35 expressed in HEK293 cells assessed as induction of beta-arrestin recruitment by ...
In DepthDetails ArticlePubMed