BDBM50323722 4-fluorophenyl 3-(4-hydroxy-3,5-dimethylstyryl)benzoate::4-fluorophenyl 3-[(E)-2-(4-hydroxy-3,5-dimethylphenyl)ethenyl]benzoate::CHEMBL1213031
SMILES Cc1cc(\C=C\c2cccc(c2)C(=O)Oc2ccc(F)cc2)cc(C)c1O
InChI Key InChIKey=YDSMVVNYVJZDET-VOTSOKGWSA-N
Data  1 IC50
PDB links: 1 PDB ID matches this monomer.
  Tab Delimited (TSV)   2D SDfile   Computed 3D by Vconf -m prep SDfile
Find this compound or compounds like it in BindingDB:
Activity Spreadsheet -- Enzyme Inhibition Constant Data from BindingDB
Found 1 hit for monomerid = 50323722
TargetTransthyretin(Homo sapiens (Human))
The Scripps Research Institute
Curated by ChEMBL
LigandPNGBDBM50323722(4-fluorophenyl 3-(4-hydroxy-3,5-dimethylstyryl)ben...)
Affinity DataIC50:  1.96E+3nMpH: 4.4Assay Description:Inhibition of wild type TTR amyloidogenesis assessed as inhibition of fibril formation after 72 hrs at pH 4.4 by spectrophotometry relative to untrea...