BDBM50323913 CHEMBL1213785::Tamoxifen isopropyl bromide
SMILES CC\C(=C(/c1ccccc1)c1ccc(OCC[N+](C)(C)C(C)C)cc1)c1ccccc1
InChI Key InChIKey=YAWPGHRGMHCVQA-ZIADKAODSA-N
Data  1 KI
  Tab Delimited (TSV)   2D SDfile   Computed 3D by Vconf -m prep SDfile
Find this compound or compounds like it in BindingDB:
Activity Spreadsheet -- Enzyme Inhibition Constant Data from BindingDB
Found 1 hit for monomerid = 50323913
TargetEstrogen receptor(Homo sapiens (Human))
Instituto PolitéCnico Nacional 2508
Curated by ChEMBL
LigandPNGBDBM50323913(CHEMBL1213785 | Tamoxifen isopropyl bromide)
Affinity DataKi:  25.4nM. Assay description: Displacement of [2,4,6,7-3H]estradiol from human ERalpha expressed in HeLa cells after 18 hrs by liquid scintillation counting
In DepthDetails ArticlePubMed