BDBM50326827 2-(4-acetamido)phenyl)-6-benzoyl-quinoline-4-carboxylic acid::CHEMBL1254700
SMILES CC(=O)Nc1ccc(cc1)-c1cc(C(O)=O)c2cc(ccc2n1)C(=O)c1ccccc1
InChI Key InChIKey=NVLYTHBERJKKNO-UHFFFAOYSA-N
Data  2 IC50
  Tab Delimited (TSV)   2D SDfile   Computed 3D by Vconf -m prep SDfile
Find this compound or compounds like it in BindingDB:
Activity Spreadsheet -- Enzyme Inhibition Constant Data from BindingDB
Found 2 hits for monomerid = 50326827
TargetCytochrome c oxidase subunit 2(Ovis aries)
Shahid Beheshti University Of Medical Sciences
Curated by ChEMBL
LigandPNGBDBM50326827(2-(4-acetamido)phenyl)-6-benzoyl-quinoline-4-carbo...)
Affinity DataIC50:  85nM. Assay description: Inhibition of sheep COX2
In DepthDetails ArticlePubMed
TargetCytochrome c oxidase subunit 1(Ovis aries)
Shahid Beheshti University Of Medical Sciences
Curated by ChEMBL
LigandPNGBDBM50326827(2-(4-acetamido)phenyl)-6-benzoyl-quinoline-4-carbo...)
Affinity DataIC50:  2.18E+4nM. Assay description: Inhibition of sheep COX1
In DepthDetails ArticlePubMed