BDBM50327104 (+/-)-threo-Ritalinol acetate::CHEMBL1253489
SMILES CC(=O)OC[C@@H]([C@H]1CCCCN1)c1ccccc1
InChI Key InChIKey=CVQUKTCWORJAAJ-HUUCEWRRSA-N
Data  1 IC50
  Tab Delimited (TSV)   2D SDfile   Computed 3D by Vconf -m prep SDfile
Find this compound or compounds like it in BindingDB:
Activity Spreadsheet -- Enzyme Inhibition Constant Data from BindingDB
Found 1 hit for monomerid = 50327104
TargetSodium-dependent dopamine transporter(Rattus norvegicus (rat))
Institute Of Technology
Curated by ChEMBL
LigandPNGBDBM50327104((+/-)-threo-Ritalinol acetate | CHEMBL1253489)
Affinity DataIC50:  690nM. Assay description: Displacement of [3H]WIN 35428 from Sprague-Dawley rat striatal tissue after 2 hrs by liquid scintillation counting
In DepthDetails ArticlePubMed