BDBM50327115 (+/-)-threo-N-(3-Chlorobenzyl)methylphenidate::CHEMBL1254195
SMILES COC(=O)[C@@H]([C@H]1CCCCN1Cc1cccc(Cl)c1)c1ccccc1
InChI Key InChIKey=MOEMZDNFRMSDIA-WOJBJXKFSA-N
Data  1 IC50
  Tab Delimited (TSV)   2D SDfile   Computed 3D by Vconf -m prep SDfile
Find this compound or compounds like it in BindingDB:
Activity Spreadsheet -- Enzyme Inhibition Constant Data from BindingDB
Found 1 hit for monomerid = 50327115
TargetSodium-dependent dopamine transporter(Rattus norvegicus (rat))
Institute Of Technology
Curated by ChEMBL
LigandPNGBDBM50327115((+/-)-threo-N-(3-Chlorobenzyl)methylphenidate | CH...)
Affinity DataIC50:  106nM. Assay description: Displacement of [3H]WIN 35428 from Sprague-Dawley rat striatal tissue after 2 hrs by liquid scintillation counting
In DepthDetails ArticlePubMed