BDBM50327132 (+/-)-threo-N-(3-Methylfuran)methylphenidate::CHEMBL1254842
SMILES COC(=O)[C@@H]([C@H]1CCCCN1Cc1ccoc1)c1ccccc1
InChI Key InChIKey=GUHBNEJVQSVUMF-QZTJIDSGSA-N
Data  1 IC50
  Tab Delimited (TSV)   2D SDfile   Computed 3D by Vconf -m prep SDfile
Find this compound or compounds like it in BindingDB:
Activity Spreadsheet -- Enzyme Inhibition Constant Data from BindingDB
Found 1 hit for monomerid = 50327132
TargetSodium-dependent dopamine transporter(Rattus norvegicus (rat))
Institute Of Technology
Curated by ChEMBL
LigandPNGBDBM50327132((+/-)-threo-N-(3-Methylfuran)methylphenidate | CHE...)
Affinity DataIC50:  459nM. Assay description: Displacement of [3H]WIN 35428 from Sprague-Dawley rat striatal tissue after 2 hrs by liquid scintillation counting
In DepthDetails ArticlePubMed