BDBM50327145 (R)-methyl 2-(4-chlorophenyl)-2-((R)-piperidin-2-yl)acetate::CHEMBL1178924
SMILES COC(=O)[C@@H]([C@H]1CCCCN1)c1ccc(Cl)cc1
InChI Key InChIKey=DJLLHNLJLSEKHJ-CHWSQXEVSA-N
Data  3 IC50
  Tab Delimited (TSV)   2D SDfile   Computed 3D by Vconf -m prep SDfile
Find this compound or compounds like it in BindingDB:
Activity Spreadsheet -- Enzyme Inhibition Constant Data from BindingDB
Found 3 hits for monomerid = 50327145
TargetSodium-dependent dopamine transporter(Rattus norvegicus (rat))
Institute Of Technology
Curated by ChEMBL
LigandPNGBDBM50327145((R)-methyl 2-(4-chlorophenyl)-2-((R)-piperidin-2-y...)
Affinity DataIC50:  20.6nM. Assay description: Displacement of [3H]WIN 35428 from Sprague-Dawley rat striatal tissue after 2 hrs by liquid scintillation counting
In DepthDetails ArticlePubMed
TargetD(1A)/D(1B)/D(2)/D(3)/D(4) dopamine receptor(Rattus norvegicus (rat))
State University Of New York
Curated by ChEMBL
LigandPNGBDBM50327145((R)-methyl 2-(4-chlorophenyl)-2-((R)-piperidin-2-y...)
Affinity DataIC50:  91nM. Assay description: Potency of inhibiting 10 pM [125I]-RTI-55 binding to dopamine receptor in rat striatal membranes
In DepthDetails ArticlePubMed
TargetD(1A)/D(1B)/D(2)/D(3)/D(4) dopamine receptor(Rattus norvegicus (rat))
State University Of New York
Curated by ChEMBL
LigandPNGBDBM50327145((R)-methyl 2-(4-chlorophenyl)-2-((R)-piperidin-2-y...)
Affinity DataIC50:  21nM. Assay description: Ability to displace 0.4 nM [3H]-paroxetine binding to serotonin transporter in rat frontal cortex
In DepthDetails ArticlePubMed