BDBM50328528 5,6-Dichloro-2-{(2S)-1-[2-methylalanyl-4-(1-methyl-6-oxo-1,6-dihydropyridin-3-yl)-L-phenylalanyl]pyrrolidin-2-yl}-1H-benzimidazole::CHEMBL1259222
SMILES Cn1cc(ccc1=O)-c1ccc(C[C@H](NC(=O)C(C)(C)N)C(=O)N2CCC[C@H]2c2nc3cc(Cl)c(Cl)cc3[nH]2)cc1
InChI Key InChIKey=VHXSUBQZTPVJFL-DQEYMECFSA-N
Data  2 IC50
  Tab Delimited (TSV)   2D SDfile   Computed 3D by Vconf -m prep SDfile
Find this compound or compounds like it in BindingDB:
Activity Spreadsheet -- Enzyme Inhibition Constant Data from BindingDB
Found 2 hits for monomerid = 50328528
TargetLysosomal Pro-X carboxypeptidase(Homo sapiens (Human))
Merck Research Laboratories
Curated by ChEMBL
LigandPNGBDBM50328528(5,6-Dichloro-2-{(2S)-1-[2-methylalanyl-4-(1-methyl...)
Affinity DataIC50:  5nM. Assay description: Inhibition of human PrCP by FRET in presence of 1% mouse serum albumin
In DepthDetails ArticlePubMed
TargetLysosomal Pro-X carboxypeptidase(Homo sapiens (Human))
Merck Research Laboratories
Curated by ChEMBL
LigandPNGBDBM50328528(5,6-Dichloro-2-{(2S)-1-[2-methylalanyl-4-(1-methyl...)
Affinity DataIC50:  7nM. Assay description: Inhibition of human PrCP by FRET
In DepthDetails ArticlePubMed