BDBM50329087 (Z)-methyl 2-(6-(ethylsulfonyl)-2-oxo-2H-benzo[b][1,4]oxazin-3(4H)-ylidene)acetate::CHEMBL1270877
SMILES CCS(=O)(=O)c1ccc2oc(=O)c(CC(=O)OC)nc2c1
InChI Key InChIKey=VNOSMITYMXLGPG-UHFFFAOYSA-N
Data  1 IC50
  Tab Delimited (TSV)   2D SDfile   Computed 3D by Vconf -m prep SDfile
Find this compound or compounds like it in BindingDB:
Activity Spreadsheet -- Enzyme Inhibition Constant Data from BindingDB
Found 1 hit for monomerid = 50329087
Target1,4-dihydroxy-2-naphthoyl-CoA synthase(Mycobacterium tuberculosis)
Stony Brook University
Curated by ChEMBL
LigandPNGBDBM50329087((Z)-methyl 2-(6-(ethylsulfonyl)-2-oxo-2H-benzo[b][...)
Affinity DataIC50:  1.79E+4nM. Assay description: Inhibition of Mycobacterium tuberculosis MenB expressed in Escherichia coli BL21 (DE3) by double-reciprocal plot analysis
In DepthDetails ArticlePubMed