BDBM50329114 CHEMBL1270883::ethyl 2-(6-(4,6-di(pyrrolidin-1-yl)-1,3,5-triazin-2-ylamino)benzo[d]thiazol-2-ylthio)acetate
SMILES CCOC(=O)CSc1nc2ccc(Nc3nc(nc(n3)N3CCCC3)N3CCCC3)cc2s1
InChI Key InChIKey=WEYJQZZTHMPTFU-UHFFFAOYSA-N
Data  1 IC50
  Tab Delimited (TSV)   2D SDfile   Computed 3D by Vconf -m prep SDfile
Find this compound or compounds like it in BindingDB:
Activity Spreadsheet -- Enzyme Inhibition Constant Data from BindingDB
Found 1 hit for monomerid = 50329114
TargetBeta-secretase 1(Homo sapiens (Human))
Singapore Polytechnic
Curated by ChEMBL
LigandPNGBDBM50329114(CHEMBL1270883 | ethyl 2-(6-(4,6-di(pyrrolidin-1-yl...)
Affinity DataIC50:  1.77E+3nM. Assay description: Inhibition of human BACE1 by FRET assay
In DepthDetails ArticlePubMed