BDBM50329811 (Z)-methyl 4-((6-(ethyl(methyl)carbamoyl)-2-oxoindolin-3-ylidene)(phenyl)methylamino)benzoate::CHEMBL1272236
SMILES CCN(C)C(=O)c1ccc2C(C(=Nc3ccc(cc3)C(=O)OC)c3ccccc3)C(=O)Nc2c1
InChI Key InChIKey=GDXBCKAXXIBATK-UHFFFAOYSA-N
Data  2 IC50
  Tab Delimited (TSV)   2D SDfile   Computed 3D by Vconf -m prep SDfile
Find this compound or compounds like it in BindingDB:
Activity Spreadsheet -- Enzyme Inhibition Constant Data from BindingDB
Found 2 hits for monomerid = 50329811
TargetPlatelet-derived growth factor receptor alpha(Homo sapiens (Human))
Boehringer Ingelheim Pharma
Curated by ChEMBL
LigandPNGBDBM50329811((Z)-methyl 4-((6-(ethyl(methyl)carbamoyl)-2-oxoind...)
Affinity DataIC50:  1.13E+3nM. Assay description: Inhibition of PDGFRalpha
In DepthDetails ArticlePubMed
TargetTGF-beta receptor type-1(Homo sapiens (Human))
Boehringer Ingelheim Pharma
Curated by ChEMBL
LigandPNGBDBM50329811((Z)-methyl 4-((6-(ethyl(methyl)carbamoyl)-2-oxoind...)
Affinity DataIC50:  1.97E+3nM. Assay description: Inhibition of TGFbeta receptor
In DepthDetails ArticlePubMed