BDBM50330375 CHEMBL1276567::N-Benzoyl-N',N''-bis(4-aminopiperidine)phosphoric triamide
SMILES O=C(NP(=O)(NN1CCCCC1)NN1CCCCC1)c1ccccc1
InChI Key InChIKey=MOOJQPSDEDEUQP-UHFFFAOYSA-N
Data  2 IC50
  Tab Delimited (TSV)   2D SDfile   Computed 3D by Vconf -m prep SDfile
Find this compound or compounds like it in BindingDB:
Activity Spreadsheet -- Enzyme Inhibition Constant Data from BindingDB
Found 2 hits for monomerid = 50330375
TargetCholinesterase(Homo sapiens (Human))
Tarbiat Modares University
Curated by ChEMBL
LigandPNGBDBM50330375(CHEMBL1276567 | N-Benzoyl-N',N''-bis(4-aminopiperi...)
Affinity DataIC50:  4.30E+5nM. Assay description: Inhibition of human BChE by Ellman method
In DepthDetails ArticlePubMed
TargetAcetylcholinesterase(Homo sapiens (Human))
Tarbiat Modares University
Curated by ChEMBL
LigandPNGBDBM50330375(CHEMBL1276567 | N-Benzoyl-N',N''-bis(4-aminopiperi...)
Affinity DataIC50:  1.95E+6nM. Assay description: Inhibition of human AChE by Ellman method
In DepthDetails ArticlePubMed