BDBM50330659 2-(4-tert-Butylbenzyl)-3-[2-(2-bromo-4-hydroxy-5-methoxyphenyl)acetamido]propyl pivalate::CHEMBL1277762
SMILES COc1cc(CC(=O)NCC(COC(=O)C(C)(C)C)Cc2ccc(cc2)C(C)(C)C)c(Br)cc1O
InChI Key InChIKey=AMOOPMVEACCAIL-UHFFFAOYSA-N
Data  1 KI
  Tab Delimited (TSV)   2D SDfile   Computed 3D by Vconf -m prep SDfile
Find this compound or compounds like it in BindingDB:
Activity Spreadsheet -- Enzyme Inhibition Constant Data from BindingDB
Found 1 hit for monomerid = 50330659
TargetTransient receptor potential cation channel subfamily V member 1(Rattus norvegicus (rat))
Seoul National University
Curated by ChEMBL
LigandPNGBDBM50330659(2-(4-tert-Butylbenzyl)-3-[2-(2-bromo-4-hydroxy-5-m...)
Affinity DataKi:  25.3nM. Assay description: Displacement of [3H]RTX from rat TRPV1 expressed in CHO cells
In DepthDetails ArticlePubMed