BDBM50330661 2-(4-tert-Butylbenzyl)-3-[2-(4-acetoxy-3-chloro-5-methoxyphenyl)acetamido]propyl pivalate::CHEMBL1277848
SMILES COc1cc(CC(=O)NCC(COC(=O)C(C)(C)C)Cc2ccc(cc2)C(C)(C)C)cc(Cl)c1OC(C)=O
InChI Key InChIKey=VKHYMJRJTSYSDO-UHFFFAOYSA-N
Data  1 KI
  Tab Delimited (TSV)   2D SDfile   Computed 3D by Vconf -m prep SDfile
Find this compound or compounds like it in BindingDB:
Activity Spreadsheet -- Enzyme Inhibition Constant Data from BindingDB
Found 1 hit for monomerid = 50330661
TargetTransient receptor potential cation channel subfamily V member 1(Rattus norvegicus (rat))
Seoul National University
Curated by ChEMBL
LigandPNGBDBM50330661(2-(4-tert-Butylbenzyl)-3-[2-(4-acetoxy-3-chloro-5-...)
Affinity DataKi:  21nM. Assay description: Displacement of [3H]RTX from rat TRPV1 expressed in CHO cells
In DepthDetails ArticlePubMed