BDBM50330665 2-(4-tert-Butylbenzyl)-3-[2-(4-acetoxy-2-bromo-5-methoxyphenyl)acetamido]propyl pivalate::CHEMBL1278013
SMILES COc1cc(CC(=O)NCC(COC(=O)C(C)(C)C)Cc2ccc(cc2)C(C)(C)C)c(Br)cc1OC(C)=O
InChI Key InChIKey=GYFNGHRIQTXBBM-UHFFFAOYSA-N
Data  1 KI
  Tab Delimited (TSV)   2D SDfile   Computed 3D by Vconf -m prep SDfile
Find this compound or compounds like it in BindingDB:
Activity Spreadsheet -- Enzyme Inhibition Constant Data from BindingDB
Found 1 hit for monomerid = 50330665
TargetTransient receptor potential cation channel subfamily V member 1(Rattus norvegicus (rat))
Seoul National University
Curated by ChEMBL
LigandPNGBDBM50330665(2-(4-tert-Butylbenzyl)-3-[2-(4-acetoxy-2-bromo-5-m...)
Affinity DataKi:  34.9nM. Assay description: Displacement of [3H]RTX from rat TRPV1 expressed in CHO cells
In DepthDetails ArticlePubMed