BDBM50330667 3-[2-(3-Bromo-4-hydroxy-5-methoxyphenyl)acetamido]-2-(3,4-dimethylbenzyl)propyl pivalate::CHEMBL1278106
SMILES COc1cc(CC(=O)NCC(COC(=O)C(C)(C)C)Cc2ccc(C)c(C)c2)cc(Br)c1O
InChI Key InChIKey=VCOUAMQURFFPAZ-UHFFFAOYSA-N
Data  1 KI
  Tab Delimited (TSV)   2D SDfile   Computed 3D by Vconf -m prep SDfile
Find this compound or compounds like it in BindingDB:
Activity Spreadsheet -- Enzyme Inhibition Constant Data from BindingDB
Found 1 hit for monomerid = 50330667
TargetTransient receptor potential cation channel subfamily V member 1(Rattus norvegicus (rat))
Seoul National University
Curated by ChEMBL
LigandPNGBDBM50330667(3-[2-(3-Bromo-4-hydroxy-5-methoxyphenyl)acetamido]...)
Affinity DataKi:  56.4nM. Assay description: Displacement of [3H]RTX from rat TRPV1 expressed in CHO cells
In DepthDetails ArticlePubMed