BDBM50331394 CHEMBL1289632::methyl 3-((4-(4-hydroxyphenyl)-1H-1,2,3-triazol-1-yl)methyl)benzoate
SMILES COC(=O)c1cccc(Cn2cc(nn2)-c2ccc(O)cc2)c1
InChI Key InChIKey=DARDLKHJGYRRGQ-UHFFFAOYSA-N
Data  1 IC50
  Tab Delimited (TSV)   2D SDfile   Computed 3D by Vconf -m prep SDfile
Find this compound or compounds like it in BindingDB:
Activity Spreadsheet -- Enzyme Inhibition Constant Data from BindingDB
Found 1 hit for monomerid = 50331394
TargetMacrophage migration inhibitory factor(Homo sapiens (Human))
Yale University
Curated by ChEMBL
LigandPNGBDBM50331394(CHEMBL1289632 | methyl 3-((4-(4-hydroxyphenyl)-1H-...)
Affinity DataIC50:  2.50E+3nM. Assay description: Inhibition of human MIF tautomerase activity using 4-hydroxyphenylpyruvate as substrate
In DepthDetails ArticlePubMed