BDBM30130 CHEMBL1201082::CHEMBL41::Fluoxetin::Fluoxetine::Prozac::US9120771, Fluoxetine::cid_62857
SMILES CNCCC(Oc1ccc(cc1)C(F)(F)F)c1ccccc1
InChI Key InChIKey=RTHCYVBBDHJXIQ-UHFFFAOYSA-N
Data  169 KI  88 IC50  4 Kd  4 EC50
PDB links: 2 PDB IDs match this monomer.
  Tab Delimited (TSV)   2D SDfile   Computed 3D by Vconf -m prep SDfile
Find this compound or compounds like it in BindingDB:
Activity Spreadsheet -- Enzyme Inhibition Constant Data from BindingDB
Found 262 hits for monomerid = 30130
TargetSodium-dependent serotonin transporter(Homo sapiens (Human))
Bristol-Myers Squibb Pharmaceutical Research Institute
Curated by ChEMBL
LigandPNGBDBM30130(CHEMBL1201082 | CHEMBL41 | Fluoxetin | Fluoxetine ...)
Affinity DataKi:  0.720nM. Assay description: Binding inhibition towards human serotonin transporter
In DepthDetails ArticlePubMedDrugBank
TargetSodium-dependent serotonin transporter(Homo sapiens (Human))
Bristol-Myers Squibb Pharmaceutical Research Institute
Curated by ChEMBL
LigandPNGBDBM30130(CHEMBL1201082 | CHEMBL41 | Fluoxetin | Fluoxetine ...)
Affinity DataKi:  0.810nM
In DepthDetails ArticlePubMedDrugBank
TargetSodium-dependent serotonin transporter(Homo sapiens (Human))
Bristol-Myers Squibb Pharmaceutical Research Institute
Curated by ChEMBL
LigandPNGBDBM30130(CHEMBL1201082 | CHEMBL41 | Fluoxetin | Fluoxetine ...)
Affinity DataKi:  0.900nM
In DepthDetails PubMedDrugBank
TargetSodium-dependent serotonin transporter(Rattus norvegicus (rat))
Veterans Administration Medical Center
Curated by PDSP Ki Database
LigandPNGBDBM30130(CHEMBL1201082 | CHEMBL41 | Fluoxetin | Fluoxetine ...)
In DepthDetails ArticlePubMed
TargetSodium-dependent serotonin transporter(Homo sapiens (Human))
Bristol-Myers Squibb Pharmaceutical Research Institute
Curated by ChEMBL
LigandPNGBDBM30130(CHEMBL1201082 | CHEMBL41 | Fluoxetin | Fluoxetine ...)
Affinity DataKi:  1.10nM
In DepthDetails PubMedDrugBank
TargetSodium-dependent serotonin transporter(Homo sapiens (Human))
Bristol-Myers Squibb Pharmaceutical Research Institute
Curated by ChEMBL
LigandPNGBDBM30130(CHEMBL1201082 | CHEMBL41 | Fluoxetin | Fluoxetine ...)
Affinity DataKi:  1.10nM. Assay description: Displacement of [3H]Citalopram from human SERT by liquid scintillation counting
In DepthDetails ArticlePubMedDrugBank
TargetSodium-dependent serotonin transporter(Homo sapiens (Human))
Bristol-Myers Squibb Pharmaceutical Research Institute
Curated by ChEMBL
LigandPNGBDBM30130(CHEMBL1201082 | CHEMBL41 | Fluoxetin | Fluoxetine ...)
Affinity DataKi:  1.10nM ΔG°:  -12.1kcal/mole EC50:  7.30nMpH: 7.4 T: 2°C. Assay description: Binding affinity of each compound was measured by assessing the potency of inhibition of binding of radiolabeled RTI-55. Membranes were preincubated ...
In DepthDetails ArticlePubMedDrugBank
TargetSodium-dependent serotonin transporter(Homo sapiens (Human))
Bristol-Myers Squibb Pharmaceutical Research Institute
Curated by ChEMBL
LigandPNGBDBM30130(CHEMBL1201082 | CHEMBL41 | Fluoxetin | Fluoxetine ...)
Affinity DataKi:  1.10nM. Assay description: Displacement of [125I]RTI55 from human recombinant SERT expressed in HEK293 cells
In DepthDetails ArticlePubMedDrugBank
TargetSodium-dependent serotonin transporter(Rattus norvegicus (rat))
Veterans Administration Medical Center
Curated by PDSP Ki Database
LigandPNGBDBM30130(CHEMBL1201082 | CHEMBL41 | Fluoxetin | Fluoxetine ...)
Affinity DataKi:  1.96nM
In DepthDetails ArticlePubMed
TargetSodium-dependent serotonin transporter(Rattus norvegicus (rat))
Veterans Administration Medical Center
Curated by PDSP Ki Database
LigandPNGBDBM30130(CHEMBL1201082 | CHEMBL41 | Fluoxetin | Fluoxetine ...)
Affinity DataKi:  1.96nM
In DepthDetails ArticlePubMed
TargetSodium-dependent serotonin transporter(Rattus norvegicus (rat))
Veterans Administration Medical Center
Curated by PDSP Ki Database
LigandPNGBDBM30130(CHEMBL1201082 | CHEMBL41 | Fluoxetin | Fluoxetine ...)
In DepthDetails PubMed
TargetSodium-dependent serotonin transporter(Homo sapiens (Human))
Bristol-Myers Squibb Pharmaceutical Research Institute
Curated by ChEMBL
LigandPNGBDBM30130(CHEMBL1201082 | CHEMBL41 | Fluoxetin | Fluoxetine ...)
Affinity DataKi:  2nM. Assay description: Binding affinity to human SERT
In DepthDetails ArticlePubMedDrugBank
TargetSodium-dependent serotonin transporter(Rattus norvegicus (rat))
Veterans Administration Medical Center
Curated by PDSP Ki Database
LigandPNGBDBM30130(CHEMBL1201082 | CHEMBL41 | Fluoxetin | Fluoxetine ...)
Affinity DataKi:  2nM. Assay description: Displacement of [3H]citalopram from serotonin transporter in Sprague-Dawley rat brain after 1 hr by liquid scintillation counting
In DepthDetails ArticlePubMed
TargetSodium-dependent serotonin transporter(Homo sapiens (Human))
Bristol-Myers Squibb Pharmaceutical Research Institute
Curated by ChEMBL
LigandPNGBDBM30130(CHEMBL1201082 | CHEMBL41 | Fluoxetin | Fluoxetine ...)
Affinity DataKi:  2.20nM. Assay description: Binding affinity at human SERT
In DepthDetails ArticlePubMedDrugBank
TargetSodium-dependent serotonin transporter(Homo sapiens (Human))
Bristol-Myers Squibb Pharmaceutical Research Institute
Curated by ChEMBL
LigandPNGBDBM30130(CHEMBL1201082 | CHEMBL41 | Fluoxetin | Fluoxetine ...)
Affinity DataKi:  2.20nM. Assay description: Binding affinity to human SERT
In DepthDetails ArticlePubMedDrugBank
TargetSodium-dependent serotonin transporter(Homo sapiens (Human))
Bristol-Myers Squibb Pharmaceutical Research Institute
Curated by ChEMBL
LigandPNGBDBM30130(CHEMBL1201082 | CHEMBL41 | Fluoxetin | Fluoxetine ...)
Affinity DataKi:  2.20nM. Assay description: Binding affinity to human SERT
In DepthDetails ArticlePubMedDrugBank
TargetSodium-dependent serotonin transporter(Rattus norvegicus (rat))
Veterans Administration Medical Center
Curated by PDSP Ki Database
LigandPNGBDBM30130(CHEMBL1201082 | CHEMBL41 | Fluoxetin | Fluoxetine ...)
Affinity DataKi:  2.70nM. Assay description: Displacement of [3H]paroxetine from 5HT transporter in rat cortical membrane
In DepthDetails ArticlePubMed
TargetSodium-dependent serotonin transporter(Rattus norvegicus (rat))
Veterans Administration Medical Center
Curated by PDSP Ki Database
LigandPNGBDBM30130(CHEMBL1201082 | CHEMBL41 | Fluoxetin | Fluoxetine ...)
Affinity DataKi:  2.70nM. Assay description: Displacement of [3H]paroxetine from rat cortical 5HTT reuptake site
In DepthDetails ArticlePubMed
TargetSodium-dependent serotonin transporter(Rattus norvegicus (rat))
Veterans Administration Medical Center
Curated by PDSP Ki Database
LigandPNGBDBM30130(CHEMBL1201082 | CHEMBL41 | Fluoxetin | Fluoxetine ...)
Affinity DataKi:  2.72nM. Assay description: Binding affinity against serotonin transporter in rat cortical tissues using radioligand [3H]-paroxetine
In DepthDetails ArticlePubMed
TargetSodium-dependent serotonin transporter(Rattus norvegicus (rat))
Veterans Administration Medical Center
Curated by PDSP Ki Database
LigandPNGBDBM30130(CHEMBL1201082 | CHEMBL41 | Fluoxetin | Fluoxetine ...)
Affinity DataKi:  2.80nM. Assay description: Binding affinity to rat SERT
In DepthDetails ArticlePubMed
TargetSodium-dependent serotonin transporter(Rattus norvegicus (rat))
Veterans Administration Medical Center
Curated by PDSP Ki Database
LigandPNGBDBM30130(CHEMBL1201082 | CHEMBL41 | Fluoxetin | Fluoxetine ...)
Affinity DataKi:  2.90nM. Assay description: Binding affinity to rat SERT
In DepthDetails ArticlePubMed
TargetSodium-dependent serotonin transporter(Rattus norvegicus (rat))
Veterans Administration Medical Center
Curated by PDSP Ki Database
LigandPNGBDBM30130(CHEMBL1201082 | CHEMBL41 | Fluoxetin | Fluoxetine ...)
Affinity DataKi:  2.90nM. Assay description: Binding affinity at rat SERT
In DepthDetails ArticlePubMed
TargetSodium-dependent serotonin transporter(Rattus norvegicus (rat))
Veterans Administration Medical Center
Curated by PDSP Ki Database
LigandPNGBDBM30130(CHEMBL1201082 | CHEMBL41 | Fluoxetin | Fluoxetine ...)
Affinity DataKi:  2.90nM. Assay description: Binding affinity to rat SERT
In DepthDetails ArticlePubMed
TargetSodium-dependent serotonin transporter(Homo sapiens (Human))
Bristol-Myers Squibb Pharmaceutical Research Institute
Curated by ChEMBL
LigandPNGBDBM30130(CHEMBL1201082 | CHEMBL41 | Fluoxetin | Fluoxetine ...)
Affinity DataKi:  3.17nM. Assay description: Evaluated for affinity at 5-HT uptake site using [3H]paroxetine as radioligand in radioligand binding assay
In DepthDetails ArticleDrugBank
TargetSodium-dependent serotonin transporter(Homo sapiens (Human))
Bristol-Myers Squibb Pharmaceutical Research Institute
Curated by ChEMBL
LigandPNGBDBM30130(CHEMBL1201082 | CHEMBL41 | Fluoxetin | Fluoxetine ...)
Affinity DataKi:  3.5nM. Assay description: Compound was evaluated for its binding affinity towards human serotonin transporter
In DepthDetails ArticlePubMedDrugBank
TargetSodium-dependent serotonin transporter(Rattus norvegicus (rat))
Veterans Administration Medical Center
Curated by PDSP Ki Database
LigandPNGBDBM30130(CHEMBL1201082 | CHEMBL41 | Fluoxetin | Fluoxetine ...)
Affinity DataKi:  3.90nM. Assay description: Displacement of [3H]paroxetine from 5-HT transporter in Sprague-Dawley rat cortical membranes
In DepthDetails ArticlePubMed
TargetSodium-dependent serotonin transporter(Rattus norvegicus (rat))
Veterans Administration Medical Center
Curated by PDSP Ki Database
LigandPNGBDBM30130(CHEMBL1201082 | CHEMBL41 | Fluoxetin | Fluoxetine ...)
Affinity DataKi:  3.90nM. Assay description: Displacement of [3H]paroxetine from serotonin transporter in Sprague-Dawley rat frontal cortical membrane
In DepthDetails ArticlePubMed
TargetSodium-dependent serotonin transporter(Rattus norvegicus (rat))
Veterans Administration Medical Center
Curated by PDSP Ki Database
LigandPNGBDBM30130(CHEMBL1201082 | CHEMBL41 | Fluoxetin | Fluoxetine ...)
Affinity DataKi:  5.60nM. Assay description: Displacement of [3H]citalopram from SERT in Sprague-Dawley rat whole brain membranes after 1 hr by liquid scintillation spectrophotometric analysis
In DepthDetails ArticlePubMed
TargetSodium-dependent serotonin transporter(Homo sapiens (Human))
Bristol-Myers Squibb Pharmaceutical Research Institute
Curated by ChEMBL
LigandPNGBDBM30130(CHEMBL1201082 | CHEMBL41 | Fluoxetin | Fluoxetine ...)
Affinity DataKi:  5.70nM
In DepthDetails PubMedDrugBank
TargetAlpha-2A adrenergic receptor(Homo sapiens (Human))
Institut De Recherches Servier
Curated by PDSP Ki Database
LigandPNGBDBM30130(CHEMBL1201082 | CHEMBL41 | Fluoxetin | Fluoxetine ...)
Affinity DataKi:  6.30nM. Assay description: Binding affinity for human alpha-2 adrenergic receptor expressed in CHO cell
In DepthDetails ArticlePubMed
TargetSodium-dependent serotonin transporter(Rattus norvegicus (rat))
Veterans Administration Medical Center
Curated by PDSP Ki Database
LigandPNGBDBM30130(CHEMBL1201082 | CHEMBL41 | Fluoxetin | Fluoxetine ...)
Affinity DataKi:  6.80nM
In DepthDetails ArticlePubMed
TargetSodium-dependent serotonin transporter(Homo sapiens (Human))
Bristol-Myers Squibb Pharmaceutical Research Institute
Curated by ChEMBL
LigandPNGBDBM30130(CHEMBL1201082 | CHEMBL41 | Fluoxetin | Fluoxetine ...)
In DepthDetails ArticlePubMedDrugBank
TargetSodium-dependent serotonin transporter(Homo sapiens (Human))
Bristol-Myers Squibb Pharmaceutical Research Institute
Curated by ChEMBL
LigandPNGBDBM30130(CHEMBL1201082 | CHEMBL41 | Fluoxetin | Fluoxetine ...)
In DepthDetails ArticlePubMedDrugBank
TargetSodium-dependent serotonin transporter(Rattus norvegicus (rat))
Veterans Administration Medical Center
Curated by PDSP Ki Database
LigandPNGBDBM30130(CHEMBL1201082 | CHEMBL41 | Fluoxetin | Fluoxetine ...)
Affinity DataKi:  7.30nM. Assay description: Inhibition of [3H]-5-HT uptake into rat synaptosomes by Serotonin transporter
In DepthDetails ArticlePubMed
TargetSodium-dependent serotonin transporter(Rattus norvegicus (rat))
Veterans Administration Medical Center
Curated by PDSP Ki Database
LigandPNGBDBM30130(CHEMBL1201082 | CHEMBL41 | Fluoxetin | Fluoxetine ...)
Affinity DataKi:  7.30nM. Assay description: Inhibition of [3H]5-HT uptake by Serotonin transporter of rat midbrain or parietal synaptosomes
In DepthDetails ArticlePubMed
TargetSodium-dependent serotonin transporter(Rattus norvegicus (rat))
Veterans Administration Medical Center
Curated by PDSP Ki Database
LigandPNGBDBM30130(CHEMBL1201082 | CHEMBL41 | Fluoxetin | Fluoxetine ...)
Affinity DataKi:  7.30nM. Assay description: Inhibition of high affinity re-uptake of [3H]5-HT (serotonin) into nerve ending synaptosomes
In DepthDetails ArticlePubMed
TargetSodium-dependent serotonin transporter(Rattus norvegicus (rat))
Veterans Administration Medical Center
Curated by PDSP Ki Database
LigandPNGBDBM30130(CHEMBL1201082 | CHEMBL41 | Fluoxetin | Fluoxetine ...)
Affinity DataKi:  8.70nM. Assay description: Displacement of [3H]citalopram from Sprague-Dawley rat SERT
In DepthDetails ArticlePubMed
TargetSodium-dependent serotonin transporter(Rattus norvegicus (rat))
Veterans Administration Medical Center
Curated by PDSP Ki Database
LigandPNGBDBM30130(CHEMBL1201082 | CHEMBL41 | Fluoxetin | Fluoxetine ...)
Affinity DataKi:  9.58nM
In DepthDetails ArticlePubMed
TargetSodium-dependent serotonin transporter(Rattus norvegicus (rat))
Veterans Administration Medical Center
Curated by PDSP Ki Database
LigandPNGBDBM30130(CHEMBL1201082 | CHEMBL41 | Fluoxetin | Fluoxetine ...)
Affinity DataKi:  10nM. Assay description: In vitro binding affinity was determined against serotonin reuptake site of rat in presence of [3H]paroxetine radioligand
In DepthDetails ArticlePubMed
TargetSodium-dependent serotonin transporter(Homo sapiens (Human))
Bristol-Myers Squibb Pharmaceutical Research Institute
Curated by ChEMBL
LigandPNGBDBM30130(CHEMBL1201082 | CHEMBL41 | Fluoxetin | Fluoxetine ...)
Affinity DataKi:  10.3nM
In DepthDetails ArticlePubMedDrugBank
TargetSodium-dependent serotonin transporter(Rattus norvegicus (rat))
Veterans Administration Medical Center
Curated by PDSP Ki Database
LigandPNGBDBM30130(CHEMBL1201082 | CHEMBL41 | Fluoxetin | Fluoxetine ...)
Affinity DataKi:  10.8nM
In DepthDetails PubMed
TargetSodium-dependent serotonin transporter(Rattus norvegicus (rat))
Veterans Administration Medical Center
Curated by PDSP Ki Database
LigandPNGBDBM30130(CHEMBL1201082 | CHEMBL41 | Fluoxetin | Fluoxetine ...)
Affinity DataKi:  10.9nM
In DepthDetails ArticlePubMed
TargetSodium-dependent dopamine transporter(MOUSE)
Mcneil Pharmaceutical
Curated by ChEMBL
LigandPNGBDBM30130(CHEMBL1201082 | CHEMBL41 | Fluoxetin | Fluoxetine ...)
Affinity DataKi:  11nM. Assay description: Tested in vitro for serotonin(5-HT) neuronal uptake inhibition
In DepthDetails ArticlePubMed
TargetSodium-dependent serotonin transporter(Rattus norvegicus (rat))
Veterans Administration Medical Center
Curated by PDSP Ki Database
LigandPNGBDBM30130(CHEMBL1201082 | CHEMBL41 | Fluoxetin | Fluoxetine ...)
Affinity DataKi:  12.2nM. Assay description: Inhibition of SERT in rat cerebral cortex assessed as [3H]serotonin accumulation
In DepthDetails ArticlePubMed
TargetSodium-dependent serotonin transporter(Rattus norvegicus (rat))
Veterans Administration Medical Center
Curated by PDSP Ki Database
LigandPNGBDBM30130(CHEMBL1201082 | CHEMBL41 | Fluoxetin | Fluoxetine ...)
Affinity DataKi:  14nM. Assay description: Inhibition of [3H]5-HT reuptake into rat frontal cortex synaptosomes
In DepthDetails ArticlePubMed
TargetSodium-dependent serotonin transporter(Homo sapiens (Human))
Bristol-Myers Squibb Pharmaceutical Research Institute
Curated by ChEMBL
LigandPNGBDBM30130(CHEMBL1201082 | CHEMBL41 | Fluoxetin | Fluoxetine ...)
Affinity DataKi:  20nM
In DepthDetails PubMedDrugBank
TargetSodium-dependent serotonin transporter(Rattus norvegicus (rat))
Veterans Administration Medical Center
Curated by PDSP Ki Database
LigandPNGBDBM30130(CHEMBL1201082 | CHEMBL41 | Fluoxetin | Fluoxetine ...)
Affinity DataKi:  22nM. Assay description: Displacement of [3H]citalopram from rat cortical serotonin transporter (SERT)
In DepthDetails ArticlePubMed
TargetSodium-dependent serotonin transporter(Rattus norvegicus (rat))
Veterans Administration Medical Center
Curated by PDSP Ki Database
LigandPNGBDBM30130(CHEMBL1201082 | CHEMBL41 | Fluoxetin | Fluoxetine ...)
Affinity DataKi:  22nM. Assay description: Inhibition of [3H]citalopram binding to Serotonin transporter of rat cerebral cortex
In DepthDetails ArticlePubMed
Target5-hydroxytryptamine receptor 2C(Rattus norvegicus (Rat))
Roche Bioscience
Curated by PDSP Ki Database
LigandPNGBDBM30130(CHEMBL1201082 | CHEMBL41 | Fluoxetin | Fluoxetine ...)
Affinity DataKi:  24.0nM
In DepthDetails ArticlePubMed
TargetSodium-dependent serotonin transporter(Homo sapiens (Human))
Bristol-Myers Squibb Pharmaceutical Research Institute
Curated by ChEMBL
LigandPNGBDBM30130(CHEMBL1201082 | CHEMBL41 | Fluoxetin | Fluoxetine ...)
Affinity DataKi:  31nM. Assay description: Displacement of [3H]citalopram from human SERT in HEK293 cells by Topcount scintillation analysis
In DepthDetails ArticlePubMedDrugBank
Displayed 1 to 50 (of 262 total ) | Next | Last >>