BDBM50331762 CHEMBL1290759::methyl 3,5-bis(trifluoromethyl)benzyl((4-cyano-5'-isopropyl-2'-methoxybiphenyl-2-yl)methyl)carbamate
SMILES COC(=O)N(Cc1cc(cc(c1)C(F)(F)F)C(F)(F)F)Cc1cc(ccc1-c1cc(ccc1OC)C(C)C)C#N
InChI Key InChIKey=GAHHWDHNPJYTSC-UHFFFAOYSA-N
Data  1 IC50
  Tab Delimited (TSV)   2D SDfile   Computed 3D by Vconf -m prep SDfile
Find this compound or compounds like it in BindingDB:
Activity Spreadsheet -- Enzyme Inhibition Constant Data from BindingDB
Found 1 hit for monomerid = 50331762
TargetCholesteryl ester transfer protein(Homo sapiens (Human))
Merck Sharp & Dohme
Curated by ChEMBL
LigandPNGBDBM50331762(CHEMBL1290759 | methyl 3,5-bis(trifluoromethyl)ben...)
Affinity DataIC50:  224nM. Assay description: Inhibition of CETP-mediated neutral lipid transfer by fluorometric analysis
In DepthDetails ArticlePubMed