BDBM50331764 CHEMBL1289209::methyl 3,5-bis(trifluoromethyl)benzyl((4-fluoro-5'-isopropyl-2'-methoxybiphenyl-2-yl)methyl)carbamate
SMILES COC(=O)N(Cc1cc(cc(c1)C(F)(F)F)C(F)(F)F)Cc1cc(F)ccc1-c1cc(ccc1OC)C(C)C
InChI Key InChIKey=PVWNUSSXDXOYPF-UHFFFAOYSA-N
Data  1 IC50
  Tab Delimited (TSV)   2D SDfile   Computed 3D by Vconf -m prep SDfile
Find this compound or compounds like it in BindingDB:
Activity Spreadsheet -- Enzyme Inhibition Constant Data from BindingDB
Found 1 hit for monomerid = 50331764
TargetCholesteryl ester transfer protein(Homo sapiens (Human))
Merck Sharp & Dohme
Curated by ChEMBL
LigandPNGBDBM50331764(CHEMBL1289209 | methyl 3,5-bis(trifluoromethyl)ben...)
Affinity DataIC50:  1.73E+3nM. Assay description: Inhibition of CETP-mediated neutral lipid transfer by fluorometric analysis
In DepthDetails ArticlePubMed