BDBM50332501 5-(4-(dimethylamino)phenyl)-N-phenyl-1,3,4-oxadiazol-2-amine::CHEMBL1630465
SMILES CN(C)c1ccc(cc1)-c1nnc(Nc2ccccc2)o1
InChI Key InChIKey=IUSAQGJKXBRYKB-UHFFFAOYSA-N
Data  1 IC50
  Tab Delimited (TSV)   2D SDfile   Computed 3D by Vconf -m prep SDfile
Find this compound or compounds like it in BindingDB:
Activity Spreadsheet -- Enzyme Inhibition Constant Data from BindingDB
Found 1 hit for monomerid = 50332501
TargetGlycogen synthase kinase-3 beta(Homo sapiens (Human))
University Of Louisiana At Monroe
Curated by ChEMBL
LigandPNGBDBM50332501(5-(4-(dimethylamino)phenyl)-N-phenyl-1,3,4-oxadiaz...)
Affinity DataIC50: >1.00E+3nM. Assay description: Inhibition of recombinant GSK3beta Z'-LYTE kinase assay kit method
In DepthDetails ArticlePubMed