BDBM50333164 CHEMBL1644837::Methyl3-({[5-(aminomethyl)-2-methyl-4-(4-methylphenyl)-6-(2-methylpropyl)pyridin-3-yl]acetyl}amino)benzoate dihydrochloride
SMILES COC(=O)c1cccc(NC(=O)Cc2c(C)nc(CC(C)C)c(CN)c2-c2ccc(C)cc2)c1
InChI Key InChIKey=FDGDHDCUVUIVMC-UHFFFAOYSA-N
Data  1 IC50
  Tab Delimited (TSV)   2D SDfile   Computed 3D by Vconf -m prep SDfile
Find this compound or compounds like it in BindingDB:
Activity Spreadsheet -- Enzyme Inhibition Constant Data from BindingDB
Found 1 hit for monomerid = 50333164
TargetDipeptidyl peptidase 4(Homo sapiens (Human))
Takeda Pharmaceutical
Curated by ChEMBL
LigandPNGBDBM50333164(CHEMBL1644837 | Methyl3-({[5-(aminomethyl)-2-methy...)
Affinity DataIC50:  3.70nM. Assay description: Inhibition of DDP4 in human Caco2 cells after 60 mins by spectrophotometry
In DepthDetails ArticlePubMed