BDBM50334654 2-Methyl-5-((1-methyl-4-phenyl-1H-imidazol-2-ylthio)-methyl)pyrazolo[1,5-c]quinazoline::CHEMBL1642570
SMILES Cc1cc2c3ccccc3nc(CSc3nc(cn3C)-c3ccccc3)n2n1
InChI Key InChIKey=OPNNZLNDTQCGOJ-UHFFFAOYSA-N
Data  1 IC50
  Tab Delimited (TSV)   2D SDfile   Computed 3D by Vconf -m prep SDfile
Find this compound or compounds like it in BindingDB:
Activity Spreadsheet -- Enzyme Inhibition Constant Data from BindingDB
Found 1 hit for monomerid = 50334654
TargetcAMP and cAMP-inhibited cGMP 3',5'-cyclic phosphodiesterase 10A(Homo sapiens (Human))
Universit£
Curated by ChEMBL
LigandPNGBDBM50334654(2-Methyl-5-((1-methyl-4-phenyl-1H-imidazol-2-ylthi...)
Affinity DataIC50:  48nM. Assay description: Inhibition of human PDE10A expressed in Sf9 cells using [3H]cAMP by scintillation proximity assay
In DepthDetails ArticlePubMed