BDBM50334684 ((1R)-4-(N-cyclopropyl-4-((S)-1,1,1-trifluoro-2-hydroxypropan-2-yl)benzamido)-1-(thiazol-4-yl)cyclohexyl)methyl carbamate::CHEMBL1642603
SMILES C[C@](O)(c1ccc(cc1)C(=O)N(C1CC1)[C@H]1CC[C@@](COC(N)=O)(CC1)c1cscn1)C(F)(F)F
InChI Key InChIKey=RJQCXBMQQJZVIC-TZYHBYERSA-N
Data  5 IC50
  Tab Delimited (TSV)   2D SDfile   Computed 3D by Vconf -m prep SDfile
Find this compound or compounds like it in BindingDB:
Activity Spreadsheet -- Enzyme Inhibition Constant Data from BindingDB
Found 5 hits for monomerid = 50334684
Target11-beta-hydroxysteroid dehydrogenase 1(Homo sapiens (Human))
Amgen
Curated by ChEMBL
LigandPNGBDBM50334684(((1R)-4-(N-cyclopropyl-4-((S)-1,1,1-trifluoro-2-hy...)
Affinity DataIC50:  1.80nM. Assay description: Inhibition of human full length 11beta-HSD1 assessed as inhibition of conversion of [3H]cortisone to [3H]cortisol by scintillation proximity assay
In DepthDetails ArticlePubMed
Target11-beta-hydroxysteroid dehydrogenase 1(Homo sapiens (Human))
Amgen
Curated by ChEMBL
LigandPNGBDBM50334684(((1R)-4-(N-cyclopropyl-4-((S)-1,1,1-trifluoro-2-hy...)
Affinity DataIC50:  63nM. Assay description: Inhibition of human recombinant full length 11beta-HSD1 expressed in HEK293 cells assessed as inhibition of conversion of [3H]cortisone to [3H]cortis...
In DepthDetails ArticlePubMed
Target11-beta-hydroxysteroid dehydrogenase 1(Rattus norvegicus (rat))
Amgen
Curated by ChEMBL
LigandPNGBDBM50334684(((1R)-4-(N-cyclopropyl-4-((S)-1,1,1-trifluoro-2-hy...)
Affinity DataIC50:  30nM. Assay description: Inhibition of rat 11beta-HSD1 assessed as inhibition of conversion of [3H]cortisone to [3H]cortisol by scintillation proximity assay
In DepthDetails ArticlePubMed
Target11-beta-hydroxysteroid dehydrogenase 1(Homo sapiens (Human))
Amgen
Curated by ChEMBL
LigandPNGBDBM50334684(((1R)-4-(N-cyclopropyl-4-((S)-1,1,1-trifluoro-2-hy...)
Affinity DataIC50:  16nM. Assay description: Inhibition of human recombinant full length 11beta-HSD1 expressed in HEK293 cells assessed as inhibition of conversion of [3H]cortisone to [3H]cortis...
In DepthDetails ArticlePubMed
Target11-beta-hydroxysteroid dehydrogenase 1(Homo sapiens (Human))
Amgen
Curated by ChEMBL
LigandPNGBDBM50334684(((1R)-4-(N-cyclopropyl-4-((S)-1,1,1-trifluoro-2-hy...)
Affinity DataIC50:  18nM. Assay description: Inhibition of human recombinant full length 11beta-HSD1 expressed in human adipocytes assessed as inhibition of conversion of [3H]cortisone to [3H]co...
In DepthDetails ArticlePubMed