BDBM50335494 (quinolin-2-ylmethyl)phosphonic acid::CHEMBL1615247::Quinolin-2-ylmethylphosphonic acid
SMILES OP(O)(=O)Cc1ccc2ccccc2n1
InChI Key InChIKey=SZCYKKWPKXABPU-UHFFFAOYSA-N
Data  1 KI  1 IC50
PDB links: 1 PDB ID matches this monomer.
  Tab Delimited (TSV)   2D SDfile   Computed 3D by Vconf -m prep SDfile
Find this compound or compounds like it in BindingDB:
Activity Spreadsheet -- Enzyme Inhibition Constant Data from BindingDB
Found 2 hits for monomerid = 50335494
Target1-deoxy-D-xylulose 5-phosphate reductoisomerase(Mycobacterium tuberculosis)
Baylor College Of Medicine
Curated by ChEMBL
LigandPNGBDBM50335494((quinolin-2-ylmethyl)phosphonic acid | CHEMBL16152...)
Affinity DataKi:  6.90E+3nM. Assay description: Inhibition of Mycobacterium tuberculosis recombinant DXR expressed in Escherichia coli BL21 (DE3) using DXP as substrate and MgCl2 as cofactor preinc...
In DepthDetails ArticlePubMed
Target1-deoxy-D-xylulose 5-phosphate reductoisomerase(Escherichia coli)
Baylor College Of Medicine
Curated by ChEMBL
LigandPNGBDBM50335494((quinolin-2-ylmethyl)phosphonic acid | CHEMBL16152...)
Affinity DataIC50:  1.59E+4nM. Assay description: Inhibition of Escherichia coli DXR