BDBM50335539 3-cyanoquinuclidin-3-yl acetate::CHEMBL1652416
SMILES CC(=O)OC1(CN2CCC1CC2)C#N
InChI Key InChIKey=SNQOLWZDRHCFQW-UHFFFAOYSA-N
Data  1 IC50
  Tab Delimited (TSV)   2D SDfile   Computed 3D by Vconf -m prep SDfile
Find this compound or compounds like it in BindingDB:
Activity Spreadsheet -- Enzyme Inhibition Constant Data from BindingDB
Found 1 hit for monomerid = 50335539
TargetTrypanothione reductase(Trypanosoma cruzi)
Monash University (Parkville Campus)
Curated by ChEMBL
LigandPNGBDBM50335539(3-cyanoquinuclidin-3-yl acetate | CHEMBL1652416)
Affinity DataIC50:  5.20E+4nM. Assay description: Inhibition of Trypanosoma cruzi X10/1 trypanothione reductase assessed as inhibition of thionitrobenzoate formation by microplate reader analysis
In DepthDetails ArticlePubMed