BDBM50336271 4-hydroxy-6-(4-hydroxy-3-methoxyphenyl)-hexa-3,5-dien-2-one::4-hydroxy-6-(4-hydroxy-3-methoxyphenyl)hexa-3,5-dien-2-one::CHEMBL211958
SMILES COc1cc(C=CC(=O)CC(C)=O)ccc1O
InChI Key InChIKey=SQDOMQCCCHMXBP-UHFFFAOYSA-N
Data  1 KI
  Tab Delimited (TSV)   2D SDfile   Computed 3D by Vconf -m prep SDfile
Find this compound or compounds like it in BindingDB:
Activity Spreadsheet -- Enzyme Inhibition Constant Data from BindingDB
Found 1 hit for monomerid = 50336271
TargetLactoylglutathione lyase(Homo sapiens (Human))
Sun Yat-Sen University
Curated by ChEMBL
LigandPNGBDBM50336271(4-hydroxy-6-(4-hydroxy-3-methoxyphenyl)-hexa-3,5-d...)
Affinity DataKi:  9.00E+4nM. Assay description: Inhibition of human recombinant His-tagged glyoxalase 1 expressed in Escherichia coli BL21 (DE3) preincubated for 20 mins by Dixon plot analysis
In DepthDetails ArticlePubMed