BDBM50336422 2-bromo-4-((1-(4-bromophenyl)-3,5-dioxopyrazolidin-4-ylidene)methyl)-6-methoxyphenyl acetate::CHEMBL1668289
SMILES COc1cc(C=C2C(=O)NN(C2=O)c2ccc(Br)cc2)cc(Br)c1OC(C)=O
InChI Key InChIKey=UJDPMFRZULRMEJ-UHFFFAOYSA-N
Data  1 IC50
  Tab Delimited (TSV)   2D SDfile   Computed 3D by Vconf -m prep SDfile
Find this compound or compounds like it in BindingDB:
Activity Spreadsheet -- Enzyme Inhibition Constant Data from BindingDB
Found 1 hit for monomerid = 50336422
TargetERO1-like protein alpha(Homo sapiens (Human))
East China University Of Science And Technology
Curated by ChEMBL
LigandPNGBDBM50336422(2-bromo-4-((1-(4-bromophenyl)-3,5-dioxopyrazolidin...)
Affinity DataIC50:  3.00E+3nM. Assay description: Inhibition of human Ero1-Lalpha
In DepthDetails ArticlePubMed