BDBM50337759 CHEMBL1683479::ethyl 2-(3-((R)-3-amino-4-(2,4,5-trifluorophenyl)butanoyl)thiazolidine-2-carboxamido)acetate hydrochloride
SMILES CCOC(=O)CNC(=O)C1SCCN1C(=O)C[C@H](N)Cc1cc(F)c(F)cc1F
InChI Key InChIKey=CGXORPGDJVUNJO-SSJGJQFISA-N
Data  1 IC50
  Tab Delimited (TSV)   2D SDfile   Computed 3D by Vconf -m prep SDfile
Find this compound or compounds like it in BindingDB:
Activity Spreadsheet -- Enzyme Inhibition Constant Data from BindingDB
Found 1 hit for monomerid = 50337759
TargetDipeptidyl peptidase 4(Homo sapiens (Human))
Korea Research Institute Of Chemical Technology
Curated by ChEMBL
LigandPNGBDBM50337759(CHEMBL1683479 | ethyl 2-(3-((R)-3-amino-4-(2,4,5-t...)
Affinity DataIC50:  101nM. Assay description: Inhibition of human recombinant DPP4 after 60 mins by fluorescence plate reader
In DepthDetails ArticlePubMed