BDBM50340863 CHEMBL1761620::ethyl 2-(4-(5-chloro-1H-indole-2-carboxamido)-3-(5-methyl-4,5,6,7-tetrahydrothiazolo[5,4-c]pyridine-2-carboxamido)phenyl)acetate
SMILES CCOC(=O)Cc1ccc(NC(=O)c2cc3cc(Cl)ccc3[nH]2)c(NC(=O)c2nc3CCN(C)Cc3s2)c1
InChI Key InChIKey=TZXJAKPSNICQKT-UHFFFAOYSA-N
Data  1 IC50
  Tab Delimited (TSV)   2D SDfile   Computed 3D by Vconf -m prep SDfile
Find this compound or compounds like it in BindingDB:
Activity Spreadsheet -- Enzyme Inhibition Constant Data from BindingDB
Found 1 hit for monomerid = 50340863
TargetCoagulation factor X(Homo sapiens (Human))
Daiichi Sankyo
Curated by ChEMBL
LigandPNGBDBM50340863(CHEMBL1761620 | ethyl 2-(4-(5-chloro-1H-indole-2-c...)
Affinity DataIC50:  170nM. Assay description: Inhibition of human factor 10a using S2222 chromogenic substrate by spectrophotometric analysis
In DepthDetails ArticlePubMed