BDBM50341272 (Z)-Methyl-2-(4-(5-(4-methoxybenzylidene)-4-oxo-4,5-dihydrothiazol-2-yl)phenoxy)acetate::CHEMBL1765902
SMILES COC(=O)COc1ccc(cc1)C1=NC(=O)\C(S1)=C\c1ccc(OC)cc1
InChI Key InChIKey=HCIAIPCMYHDJDP-BOPFTXTBSA-N
Data  4 IC50
  Tab Delimited (TSV)   2D SDfile   Computed 3D by Vconf -m prep SDfile
Find this compound or compounds like it in BindingDB:
Activity Spreadsheet -- Enzyme Inhibition Constant Data from BindingDB
Found 4 hits for monomerid = 50341272
TargetPolyunsaturated fatty acid 5-lipoxygenase(Homo sapiens (Human))
Goethe-University Frankfurt
Curated by ChEMBL
LigandPNGBDBM50341272((Z)-Methyl-2-(4-(5-(4-methoxybenzylidene)-4-oxo-4,...)
Affinity DataIC50:  860nM. Assay description: Inhibition of 5-lipoxygenase in human polymorphonuclear leukocytes assessed as inhibition of LTB4 production preincubated for 15 mins measured after ...Checked by Author
In DepthDetails ArticlePubMed
TargetPolyunsaturated fatty acid 5-lipoxygenase(Homo sapiens (Human))
Goethe-University Frankfurt
Curated by ChEMBL
LigandPNGBDBM50341272((Z)-Methyl-2-(4-(5-(4-methoxybenzylidene)-4-oxo-4,...)
Affinity DataIC50:  580nM. Assay description: Inhibition of 5-lipoxygenase in S100 supernatant assessed as inhibition of (5(S)-hydroperoxy-6-trans-8,11,14-cis-eicosatetraenoic acid production pre...Checked by Author
In DepthDetails ArticlePubMed
TargetPolyunsaturated fatty acid 5-lipoxygenase(Homo sapiens (Human))
Goethe-University Frankfurt
Curated by ChEMBL
LigandPNGBDBM50341272((Z)-Methyl-2-(4-(5-(4-methoxybenzylidene)-4-oxo-4,...)
Affinity DataIC50:  580nM. Assay description: Inhibition of 5-lipoxygenase in S100 supernatant assessed as inhibition of LTB4 production preincubated for 15 mins measured after 10 mins by HPLC me...Checked by Author
In DepthDetails ArticlePubMed
TargetPolyunsaturated fatty acid 5-lipoxygenase(Homo sapiens (Human))
Goethe-University Frankfurt
Curated by ChEMBL
LigandPNGBDBM50341272((Z)-Methyl-2-(4-(5-(4-methoxybenzylidene)-4-oxo-4,...)
Affinity DataIC50:  860nM. Assay description: Inhibition of 5-lipoxygenase in human polymorphonuclear leukocytes assessed as inhibition of (5(S)-hydroperoxy-6-trans-8,11,14-cis-eicosatetraenoic a...Checked by Author
In DepthDetails ArticlePubMed