BDBM50342515 5-(1-(2-Acetamidoethyl)-1H-1,2,3-triazol-4-yl)-N-(2-(2-(4-(3-(5-amino-2-(furan-2-yl)-7Hpyrazolo[4,3-e][1,2,4]triazolo[1,5-c]pyrimidin-7-yl)propyl)phenoxy)acetamido)ethyl)pentanamide::CHEMBL1770169
SMILES CC(=O)NCCn1cc(CCCCC(=O)NCCNC(=O)COc2ccc(CCCn3ncc4c3nc(N)n3nc(nc43)-c3ccco3)cc2)nn1
InChI Key InChIKey=TYYMLDWFIXNBON-UHFFFAOYSA-N
Data  3 KI
  Tab Delimited (TSV)   2D SDfile   Computed 3D by Vconf -m prep SDfile
Find this compound or compounds like it in BindingDB:
Activity Spreadsheet -- Enzyme Inhibition Constant Data from BindingDB
Found 3 hits for monomerid = 50342515
TargetAdenosine receptor A2a(Homo sapiens (Human))
National Institute Of Diabetes And Digestive And Kidney Diseases
Curated by ChEMBL
LigandPNGBDBM50342515(5-(1-(2-Acetamidoethyl)-1H-1,2,3-triazol-4-yl)-N-(...)
Affinity DataKi:  220nM. Assay description: Displacement of [3H]CGS21680 from human recombinant adenosine A2A receptor expressed in HEK293 cells after 60 mins by liquid scintillation counting
In DepthDetails ArticlePubMed
TargetAdenosine receptor A3(Homo sapiens (Human))
National Institute Of Diabetes And Digestive And Kidney Diseases
Curated by ChEMBL
LigandPNGBDBM50342515(5-(1-(2-Acetamidoethyl)-1H-1,2,3-triazol-4-yl)-N-(...)
Affinity DataKi:  302nM. Assay description: Displacement of [125I]I-AB-MECA from human recombinant adenosine A3 receptor expressed in CHO cells after 60 mins by gamma scintillation counting
In DepthDetails ArticlePubMed
TargetAdenosine receptor A1(Homo sapiens (Human))
National Institute Of Diabetes And Digestive And Kidney Diseases
Curated by ChEMBL
LigandPNGBDBM50342515(5-(1-(2-Acetamidoethyl)-1H-1,2,3-triazol-4-yl)-N-(...)
Affinity DataKi:  1.70E+3nM. Assay description: Displacement of [3H]DPCPX from human recombinant adenosine A1 receptor expressed in CHO cells after 60 mins by liquid scintillation counting
In DepthDetails ArticlePubMed