BDBM50344276 (R)-quinuclidin-3-yl benzyl(thiophen-2-ylmethyl)carbamate::CHEMBL1779039
SMILES O=C(O[C@H]1CN2CCC1CC2)N(Cc1cccs1)Cc1ccccc1
InChI Key InChIKey=CRWJHTMQXCFORB-IBGZPJMESA-N
Data  3 IC50
  Tab Delimited (TSV)   2D SDfile   Computed 3D by Vconf -m prep SDfile
Find this compound or compounds like it in BindingDB:
Activity Spreadsheet -- Enzyme Inhibition Constant Data from BindingDB
Found 3 hits for monomerid = 50344276
TargetMuscarinic acetylcholine receptor M1(Homo sapiens (Human))
RhôNe-Poulenc Rorer
Curated by ChEMBL
LigandPNGBDBM50344276((R)-quinuclidin-3-yl benzyl(thiophen-2-ylmethyl)ca...)
Affinity DataIC50:  8.80nM. Assay description: Displacement of [3H]NMS from human muscarinic M1 receptor expressed in CHO-K1 cells after 1 hr by scintillation counting
In DepthDetails ArticlePubMed
TargetMuscarinic acetylcholine receptor M2(Homo sapiens (Human))
RhôNe-Poulenc Rorer
Curated by ChEMBL
LigandPNGBDBM50344276((R)-quinuclidin-3-yl benzyl(thiophen-2-ylmethyl)ca...)
Affinity DataIC50:  88.9nM. Assay description: Displacement of [3H]NMS from human muscarinic M2 receptor expressed in CHO-K1 cells after 1 hr by scintillation counting
In DepthDetails ArticlePubMed
TargetMuscarinic acetylcholine receptor M3(Homo sapiens (Human))
RhôNe-Poulenc Rorer
Curated by ChEMBL
LigandPNGBDBM50344276((R)-quinuclidin-3-yl benzyl(thiophen-2-ylmethyl)ca...)
Affinity DataIC50:  22.5nM. Assay description: Displacement of [3H]NMS from human muscarinic M3 receptor expressed in CHO-K1 cells after 1 hr by scintillation counting
In DepthDetails ArticlePubMed