BDBM50344281 (R)-quinuclidin-3-yl 3-fluorobenzyl(3-fluorophenyl)carbamate::CHEMBL1779044
SMILES Fc1cccc(CN(C(=O)O[C@H]2CN3CCC2CC3)c2cccc(F)c2)c1
InChI Key InChIKey=URDXFKMXLZZTRI-FQEVSTJZSA-N
Data  3 IC50
  Tab Delimited (TSV)   2D SDfile   Computed 3D by Vconf -m prep SDfile
Find this compound or compounds like it in BindingDB:
Activity Spreadsheet -- Enzyme Inhibition Constant Data from BindingDB
Found 3 hits for monomerid = 50344281
TargetMuscarinic acetylcholine receptor M1(Homo sapiens (Human))
RhôNe-Poulenc Rorer
Curated by ChEMBL
LigandPNGBDBM50344281((R)-quinuclidin-3-yl 3-fluorobenzyl(3-fluorophenyl...)
Affinity DataIC50:  1.5nM. Assay description: Displacement of [3H]NMS from human muscarinic M1 receptor expressed in CHO-K1 cells after 1 hr by scintillation counting
In DepthDetails ArticlePubMed
TargetMuscarinic acetylcholine receptor M2(Homo sapiens (Human))
RhôNe-Poulenc Rorer
Curated by ChEMBL
LigandPNGBDBM50344281((R)-quinuclidin-3-yl 3-fluorobenzyl(3-fluorophenyl...)
Affinity DataIC50:  26.8nM. Assay description: Displacement of [3H]NMS from human muscarinic M2 receptor expressed in CHO-K1 cells after 1 hr by scintillation counting
In DepthDetails ArticlePubMed
TargetMuscarinic acetylcholine receptor M3(Homo sapiens (Human))
RhôNe-Poulenc Rorer
Curated by ChEMBL
LigandPNGBDBM50344281((R)-quinuclidin-3-yl 3-fluorobenzyl(3-fluorophenyl...)
Affinity DataIC50:  2.40nM. Assay description: Displacement of [3H]NMS from human muscarinic M3 receptor expressed in CHO-K1 cells after 1 hr by scintillation counting
In DepthDetails ArticlePubMed