BDBM50344582 2-(3-methyl-5-(N-(6-methyl-4-(trifluoromethyl)pyridin-2-ylcarbamoyl)sulfamoyl)thiophen-2-yl)ethyl acetate::CHEMBL1778559
SMILES CC(=O)OCCc1sc(cc1C)S(=O)(=O)NC(=O)Nc1cc(cc(C)n1)C(F)(F)F
InChI Key InChIKey=RDPIGKWQPAYCNH-UHFFFAOYSA-N
Data  2 IC50
  Tab Delimited (TSV)   2D SDfile   Computed 3D by Vconf -m prep SDfile
Find this compound or compounds like it in BindingDB:
Activity Spreadsheet -- Enzyme Inhibition Constant Data from BindingDB
Found 2 hits for monomerid = 50344582
TargetFructose-1,6-bisphosphatase 1(Mus musculus)
F. Hoffmann-La Roche
Curated by ChEMBL
LigandPNGBDBM50344582(2-(3-methyl-5-(N-(6-methyl-4-(trifluoromethyl)pyri...)
Affinity DataIC50:  7.30E+3nM. Assay description: Inhibition of mouse liver fructose-1,6-bisphosphatase
In DepthDetails ArticlePubMed
TargetFructose-1,6-bisphosphatase 1(Homo sapiens (Human))
F. Hoffmann-La Roche
Curated by ChEMBL
LigandPNGBDBM50344582(2-(3-methyl-5-(N-(6-methyl-4-(trifluoromethyl)pyri...)
Affinity DataIC50:  520nM. Assay description: Inhibition of human liver fructose-1,6-bisphosphatase
In DepthDetails ArticlePubMed