BDBM50344611 (E)-4-(3-(5-Bromo-4-hydroxy-2-methoxyphenyl)acryloyl)phenyl benzoate::CHEMBL1778908
SMILES COc1cc(O)c(Br)cc1\C=C\C(=O)c1ccc(OC(=O)c2ccccc2)cc1
InChI Key InChIKey=RQXYHTXFRAPVMA-FMIVXFBMSA-N
Data  1 IC50
  Tab Delimited (TSV)   2D SDfile   Computed 3D by Vconf -m prep SDfile
Find this compound or compounds like it in BindingDB:
Activity Spreadsheet -- Enzyme Inhibition Constant Data from BindingDB
Found 1 hit for monomerid = 50344611
TargetTyrosine-protein phosphatase non-receptor type 1(Homo sapiens (Human))
Chonnam National University
Curated by ChEMBL
LigandPNGBDBM50344611((E)-4-(3-(5-Bromo-4-hydroxy-2-methoxyphenyl)acrylo...)
Affinity DataIC50:  4.90E+3nM. Assay description: Inhibition of recombinant human PTP1B using p-nitrophenyl phosphate as substrate after 30 mins
In DepthDetails ArticlePubMed