BDBM50344860 CHEMBL1780052::methyl-2-(3-(benzo[d][1,3]dioxol-5-yl)-2-oxo-1-pentylindolin-3-yl)acetate
SMILES CCCCCN1C(=O)C(CC(=O)OC)(c2ccccc12)c1ccc2OCOc2c1
InChI Key InChIKey=BDOHZQWERPJXOY-UHFFFAOYSA-N
Data  1 IC50
  Tab Delimited (TSV)   2D SDfile   Computed 3D by Vconf -m prep SDfile
Find this compound or compounds like it in BindingDB:
Activity Spreadsheet -- Enzyme Inhibition Constant Data from BindingDB
Found 1 hit for monomerid = 50344860
TargetSodium channel protein type 9 subunit alpha(Homo sapiens (Human))
Xenon Pharmaceuticals
Curated by ChEMBL
LigandPNGBDBM50344860(CHEMBL1780052 | methyl-2-(3-(benzo[d][1,3]dioxol-5...)
Affinity DataIC50: >5.00E+3nM. Assay description: Inhibition of human NaV1.7 expressed in HEK293 cells by [14C]guanidinium influx assay
In DepthDetails ArticlePubMed