BDBM50345176 CHEMBL1779743::N-Methyl-N-((1-methyl-1H-indol-3-yl)(phenyl)methyl)benzenamine
SMILES CN(C(c1cn(C)c2ccccc12)c1ccccc1)c1ccccc1
InChI Key InChIKey=UEGUIZXFANDJHZ-UHFFFAOYSA-N
Data  1 IC50
  Tab Delimited (TSV)   2D SDfile   Computed 3D by Vconf -m prep SDfile
Find this compound or compounds like it in BindingDB:
Activity Spreadsheet -- Enzyme Inhibition Constant Data from BindingDB
Found 1 hit for monomerid = 50345176
TargetProto-oncogene tyrosine-protein kinase Src(Homo sapiens (Human))
India Institute Of Technology And Science
Curated by ChEMBL
LigandPNGBDBM50345176(CHEMBL1779743 | N-Methyl-N-((1-methyl-1H-indol-3-y...)
Affinity DataIC50: >1.50E+5nM. Assay description: Inhibition of c-Src using AEEEIYGEFEAKKKK substrate by fluorescence intensity assay
In DepthDetails ArticlePubMed