BDBM50345785 CHEMBL1784984::ethyl 2-hydroxy-6-(8-hydroxyoctyl)benzoate
SMILES CCOC(=O)c1c(O)cccc1CCCCCCCCO
InChI Key InChIKey=HNECLBVQVICJQX-UHFFFAOYSA-N
Data  1 IC50
  Tab Delimited (TSV)   2D SDfile   Computed 3D by Vconf -m prep SDfile
Find this compound or compounds like it in BindingDB:
Activity Spreadsheet -- Enzyme Inhibition Constant Data from BindingDB
Found 1 hit for monomerid = 50345785
TargetGlyceraldehyde-3-phosphate dehydrogenase, glycosomal(Trypanosoma cruzi)
Universidade Federal De S£O Carlos
Curated by ChEMBL
LigandPNGBDBM50345785(CHEMBL1784984 | ethyl 2-hydroxy-6-(8-hydroxyoctyl)...)
Affinity DataIC50: >2.50E+5nM. Assay description: Inhibition of Trypanosoma cruzi recombinant glycosomal GAPDH expressed in Escherichia coli using GAPDH and D-glyceraldehyde-3-phosphate
In DepthDetails ArticlePubMed